Target
Beta-2 adrenergic receptor
Ligand
BDBM50213103
Substrate
Meas. Tech.
ChEMBL_755355 (CHEMBL1804511)
EC50
8.5±n/a nM
Citation
 Jozwiak, KWoo, AYTanga, MJToll, LJimenez, LKozocas, JAPlazinska, AXiao, RPWainer, IW Comparative molecular field analysis of fenoterol derivatives: A platform towards highly selective and effective beta(2)-adrenergic receptor agonists. Bioorg Med Chem 18:728-36 (2010)  
Target
Name:
Beta-2 adrenergic receptor
Synonyms:
ADRB2 ADRB2_HUMAN Beta-2 adrenoceptor | Beta-2 adrenoreceptor
Type:
Mol. Mass.:
46461.69
Organism:
Homo sapiens (Human)
Description:
P07550
Residue:
413
  
Inhibitor
Name:
BDBM50213103
Synonyms:
(S,R)-(+)-fenoterol US10617654, Compound (S,R)-1 US9492405, 30
Type:
Small organic molecule
Emp. Form.:
C17H21NO4
Mol. Mass.:
303.3529
SMILES:
C[C@H](Cc1ccc(O)cc1)NC[C@@H](O)c1cc(O)cc(O)c1
: