Target
Beta-2 adrenergic receptor
Ligand
BDBM50213120
Substrate
Meas. Tech.
ChEMBL_755355 (CHEMBL1804511)
EC50
2±n/a nM
Citation
 Jozwiak, KWoo, AYTanga, MJToll, LJimenez, LKozocas, JAPlazinska, AXiao, RPWainer, IW Comparative molecular field analysis of fenoterol derivatives: A platform towards highly selective and effective beta(2)-adrenergic receptor agonists. Bioorg Med Chem 18:728-36 (2010)  
Target
Name:
Beta-2 adrenergic receptor
Synonyms:
ADRB2 ADRB2_HUMAN Beta-2 adrenoceptor | Beta-2 adrenoreceptor
Type:
Mol. Mass.:
46461.69
Organism:
Homo sapiens (Human)
Description:
P07550
Residue:
413
  
Inhibitor
Name:
BDBM50213120
Synonyms:
(R,S)-(-)-1-p-methoxyphenyl-2-(beta-3',5'-dihydroxyphenyl-beta-oxy)ethylaminopropane US10617654, Compound (R,S)-2 US9492405, (R,S)-2
Type:
Small organic molecule
Emp. Form.:
C18H23NO4
Mol. Mass.:
317.3795
SMILES:
COc1ccc(C[C@H](C)NC[C@H](O)c2cc(O)cc(O)c2)cc1
: