Target
Transmembrane protease serine 11D
Ligand
BDBM50349363
Substrate
Meas. Tech.
ChEMBL_760105 (CHEMBL1810428)
Ki
63±n/a nM
Citation
 Sielaff, FBöttcher-Friebertshäuser, EMeyer, DSaupe, SMVolk, IMGarten, WSteinmetzer, T Development of substrate analogue inhibitors for the human airway trypsin-like protease HAT. Bioorg Med Chem Lett 21:4860-4 (2011)  
Target
Name:
Transmembrane protease serine 11D
Synonyms:
Airway trypsin-like protease TM11D_HUMAN Transmembrane protease serine 11D catalytic chain | Transmembrane protease serine 11D non-catalytic chain
Type:
PROTEIN
Mol. Mass.:
46272.53
Organism:
Homo sapiens (Human)
Description:
ChEMBL_840134
Residue:
418
  
Inhibitor
Name:
BDBM50349363
Synonyms:
CHEMBL1809218
Type:
Small organic molecule
Emp. Form.:
C30H35N5O4S
Mol. Mass.:
561.695
SMILES:
NC(=N)c1ccc(CNC(=O)[C@@H]2CCCN2C(=O)[C@@H](CCc2ccccc2)NS(=O)(=O)Cc2ccccc2)cc1
: