Target
Potassium voltage-gated channel subfamily H member 2
Ligand
BDBM25150
Substrate
Meas. Tech.
ChEMBL_759504 (CHEMBL1810945)
IC50
>30000±n/a nM
Citation
 Shultz, MFan, JChen, CCho, YSDavis, NBickford, SButeau, KCao, XHolmqvist, MHsu, MJiang, LLiu, GLu, QPatel, CSuresh, JRSelvaraj, MUrban, LWang, PYan-Neale, YWhitehead, LZhang, HZhou, LAtadja, P The design, synthesis and structure-activity relationships of novel isoindoline-based histone deacetylase inhibitors. Bioorg Med Chem Lett 21:4909-12 (2011)  
Target
Name:
Potassium voltage-gated channel subfamily H member 2
Synonyms:
1,3-beta-glucan synthase component GLS2 ERG Eag-related protein 1 Ether-a-go-go-related gene (HERG) Ether-a-go-go-related gene potassium channel 1 Ether-a-go-go-related gene potassium channel 1 (hERG1) Ether-a-go-go-related protein 1 H-ERG KCNH2 Potassium voltage-gated channel subfamily H member 2 (hERG) Voltage-gated potassium channel subunit Kv11.1 hERG Potassium Channel 1 | putative potassium channel subunit
Type:
Multi-pass membrane protein
Mol. Mass.:
126672.65
Organism:
Homo sapiens (Human)
Description:
Q12809
Residue:
1159
  
Inhibitor
Name:
BDBM25150
Synonyms:
(2E)-N-hydroxy-3-[3-(phenylsulfamoyl)phenyl]prop-2-enamide Belinostat PXD101
Type:
Small organic molecule
Emp. Form.:
C15H14N2O4S
Mol. Mass.:
318.348
SMILES:
ONC(=O)\C=C\c1cccc(c1)S(=O)(=O)Nc1ccccc1
: