Target
C-X-C chemokine receptor type 3
Ligand
BDBM50349660
Substrate
Meas. Tech.
ChEMBL_760044 (CHEMBL1810320)
IC50
7±n/a nM
Citation
 Thoma, GBaenteli, RLewis, IJones, DKovarik, JStreiff, MBZerwes, HG Special ergolines efficiently inhibit the chemokine receptor CXCR3 in blood. Bioorg Med Chem Lett 21:4745-9 (2011)  
Target
Name:
C-X-C chemokine receptor type 3
Synonyms:
AAO92295.1 C-X-C chemokine receptor type 3 (CXCR3) CXCR3 CXCR3_HUMAN chemokine (C-X-C motif) receptor 3
Type:
Enzyme Catalytic Domain
Mol. Mass.:
40665.65
Organism:
Homo sapiens (Human)
Description:
Residue:
368
  
Inhibitor
Name:
BDBM50349660
Synonyms:
CHEMBL1809024
Type:
Small organic molecule
Emp. Form.:
C24H24N4O2S
Mol. Mass.:
432.538
SMILES:
O=C(Nc1ccsc1)N1C[C@@H](C=C2[C@H]1Cc1c[nH]c3cccc2c13)C(=O)N1CCCC1
: