Target
C-X-C chemokine receptor type 3
Ligand
BDBM50349647
Substrate
Meas. Tech.
ChEMBL_760045 (CHEMBL1810321)
IC50
112±n/a nM
Citation
 Thoma, GBaenteli, RLewis, IJones, DKovarik, JStreiff, MBZerwes, HG Special ergolines efficiently inhibit the chemokine receptor CXCR3 in blood. Bioorg Med Chem Lett 21:4745-9 (2011)  
Target
Name:
C-X-C chemokine receptor type 3
Synonyms:
CXCR3_MOUSE Cxcr3
Type:
PROTEIN
Mol. Mass.:
41020.84
Organism:
Mus musculus
Description:
ChEMBL_560734
Residue:
367
  
Inhibitor
Name:
BDBM50349647
Synonyms:
CHEMBL1809006
Type:
Small organic molecule
Emp. Form.:
C27H29N5O2
Mol. Mass.:
455.5515
SMILES:
CN1CCN(CC1)C(=O)[C@H]1CN([C@@H]2Cc3c[nH]c4cccc(C2=C1)c34)C(=O)Nc1ccccc1
: