Target
C-X-C chemokine receptor type 3
Ligand
BDBM50349660
Substrate
Meas. Tech.
ChEMBL_760045 (CHEMBL1810321)
IC50
11±n/a nM
Citation
 Thoma, GBaenteli, RLewis, IJones, DKovarik, JStreiff, MBZerwes, HG Special ergolines efficiently inhibit the chemokine receptor CXCR3 in blood. Bioorg Med Chem Lett 21:4745-9 (2011)  
Target
Name:
C-X-C chemokine receptor type 3
Synonyms:
CXCR3_MOUSE Cxcr3
Type:
PROTEIN
Mol. Mass.:
41020.84
Organism:
Mus musculus
Description:
ChEMBL_560734
Residue:
367
  
Inhibitor
Name:
BDBM50349660
Synonyms:
CHEMBL1809024
Type:
Small organic molecule
Emp. Form.:
C24H24N4O2S
Mol. Mass.:
432.538
SMILES:
O=C(Nc1ccsc1)N1C[C@@H](C=C2[C@H]1Cc1c[nH]c3cccc2c13)C(=O)N1CCCC1
: