Target
Glutamate receptor ionotropic, kainate 1
Ligand
BDBM50107595
Substrate
Meas. Tech.
ChEMBL_761797 (CHEMBL1817064)
Ki
44±n/a nM
Citation
 Venskutonyte, RButini, SCoccone, SSGemma, SBrindisi, MKumar, VGuarino, EMaramai, SValenti, SAmir, AValadés, EAFrydenvang, KKastrup, JSNovellino, ECampiani, GPickering, DS Selective kainate receptor (GluK1) ligands structurally based upon 1H-cyclopentapyrimidin-2,4(1H,3H)-dione: synthesis, molecular modeling, and pharmacological and biostructural characterization. J Med Chem 54:4793-805 (2011)  
Target
Name:
Glutamate receptor ionotropic, kainate 1
Synonyms:
GRIK1_RAT Glutamate receptor ionotropic kainate 1 Glutamate receptor, ionotropic kainate 1 Grik1
Type:
Enzyme Catalytic Domain
Mol. Mass.:
107860.82
Organism:
RAT
Description:
P22756
Residue:
949
  
Inhibitor
Name:
BDBM50107595
Synonyms:
(S)-1-(2-Amino-2-carboxyethyl)-6,7-dihydro-1H-cyclopenta[d]-pyrimidin-2,4(1H,3H)dione 2-Amino-3-(2,4-dioxo-2,3,4,5,6,7-hexahydro-cyclopentapyrimidin-1-yl)-propionic acid | CHEMBL337577
Type:
Small organic molecule
Emp. Form.:
C10H13N3O4
Mol. Mass.:
239.2279
SMILES:
N[C@@H](Cn1c2CCCc2c(=O)[nH]c1=O)C(O)=O
: