Target
Cannabinoid receptor 1
Ligand
BDBM50350159
Substrate
Meas. Tech.
ChEMBL_761450 (CHEMBL1817171)
Ki
>10000±n/a nM
Citation
 Pasquini, SDe Rosa, MPedani, VMugnaini, CGuida, FLuongo, LDe Chiaro, MMaione, SDragoni, SFrosini, MLigresti, ADi Marzo, VCorelli, F Investigations on the 4-quinolone-3-carboxylic acid motif. 4. Identification of new potent and selective ligands for the cannabinoid type 2 receptor with diverse substitution patterns and antihyperalgesic effects in mice. J Med Chem 54:5444-53 (2011)  
Target
Name:
Cannabinoid receptor 1
Synonyms:
CANN6 CB-R CNR CNR1_HUMAN Cannabinoid receptor Cannabinoid receptor 1 (brain)
Type:
G Protein-Coupled Receptor (GPCR)
Mol. Mass.:
52868.96
Organism:
Homo sapiens (Human)
Description:
P21554
Residue:
472
  
Inhibitor
Name:
BDBM50350159
Synonyms:
CHEMBL1814466
Type:
Small organic molecule
Emp. Form.:
C25H31BrN2O3
Mol. Mass.:
487.429
SMILES:
CCCCCn1c2ccc(Br)cc2c(O)c(C(=O)NC23CC4CC(CC(C4)C2)C3)c1=O
: