Target
Acetylcholinesterase
Ligand
BDBM50350324
Substrate
Meas. Tech.
ChEMBL_762145 (CHEMBL1816216)
Ki
>100000±n/a nM
Citation
 Parkinson, EIJason Hatfield, MTsurkan, LHyatt, JLEdwards, CCHicks, LDYan, BPotter, PM Requirements for mammalian carboxylesterase inhibition by substituted ethane-1,2-diones. Bioorg Med Chem 19:4635-43 (2011)  
Target
Name:
Acetylcholinesterase
Synonyms:
ACES_HUMAN Acetylcholinesterase (AChE) | Acetylcholinesterase (human AChE)
Type:
Enzyme
Mol. Mass.:
67792.70
Organism:
Homo sapiens (Human)
Description:
P22303
Residue:
614
  
Inhibitor
Name:
BDBM50350324
Synonyms:
CHEMBL1812862
Type:
Small organic molecule
Emp. Form.:
C12H14O2
Mol. Mass.:
190.2384
SMILES:
CCCCC(=O)C(=O)c1ccccc1
: