Target
Polyunsaturated fatty acid lipoxygenase ALOX15
Ligand
BDBM22372
Substrate
Meas. Tech.
ChEMBL_761391 (CHEMBL1817021)
IC50
5100±n/a nM
Citation
 Kenyon, VRai, GJadhav, ASchultz, LArmstrong, MJameson, JBPerry, SJoshi, NBougie, JMLeister, WTaylor-Fishwick, DANadler, JLHolinstat, MSimeonov, AMaloney, DJHolman, TR Discovery of potent and selective inhibitors of human platelet-type 12- lipoxygenase. J Med Chem 54:5485-97 (2011)  
Target
Name:
Polyunsaturated fatty acid lipoxygenase ALOX15
Synonyms:
15-Lipoxygenase-1 (15-LOX-1) Arachidonate 15-lipoxygenase LOG15 Reticulocyte 15-lipoxygenase-1 | Sphingosine 1-phosphate receptor 1 (S1P1)
Type:
Protein
Mol. Mass.:
74804.05
Organism:
Homo sapiens (Human)
Description:
Residue:
662
  
Inhibitor
Name:
BDBM22372
Synonyms:
4-[(2R,3S)-4-(3,4-dihydroxyphenyl)-2,3-dimethylbutyl]benzene-1,2-diol CHEMBL313972 NDGA | Nordihydroguaiaretic Acid
Type:
Antioxidant
Emp. Form.:
C18H22O4
Mol. Mass.:
302.3649
SMILES:
C[C@@H](Cc1ccc(O)c(O)c1)[C@H](C)Cc1ccc(O)c(O)c1
: