Target
NAD-dependent protein deacetylase sirtuin-1
Ligand
BDBM50350511
Substrate
Meas. Tech.
ChEMBL_762655 (CHEMBL1817379)
IC50
290000±n/a nM
Citation
 Hirsch, BMHao, YLi, XWesdemiotis, CWang, ZZheng, W A mechanism-based potent sirtuin inhibitor containing Ne-thiocarbamoyl-lysine (TuAcK). Bioorg Med Chem Lett 21:4753-7 (2011)  
Target
Name:
NAD-dependent protein deacetylase sirtuin-1
Synonyms:
NAD-Dependent Deacetylase Sirtuin-1 NAD-dependent protein deacetylase sirtuin-1 (SIRT1) SIR2-like protein 1 SIRT1 Sirtuin-1 (SIRT1) | hSIR2
Type:
Developmental protein; hydrolase
Mol. Mass.:
81626.66
Organism:
Homo sapiens (Human)
Description:
Residue:
747
  
Inhibitor
Name:
BDBM50350511
Synonyms:
CHEMBL1814816
Type:
Small organic molecule
Emp. Form.:
C26H47N7O7
Mol. Mass.:
569.6941
SMILES:
CC(=O)NCCCC[C@H](NC(=O)[C@H](CCCCCC(N)=O)NC(=O)[C@H](CCCCNC(C)=O)NC(C)=O)C(N)=O
: