Target
NAD-dependent protein deacetylase sirtuin-2
Ligand
BDBM50350511
Substrate
Meas. Tech.
ChEMBL_762656 (CHEMBL1817380)
IC50
190200±n/a nM
Citation
 Hirsch, BMHao, YLi, XWesdemiotis, CWang, ZZheng, W A mechanism-based potent sirtuin inhibitor containing Ne-thiocarbamoyl-lysine (TuAcK). Bioorg Med Chem Lett 21:4753-7 (2011)  
Target
Name:
NAD-dependent protein deacetylase sirtuin-2
Synonyms:
NAD-Dependent Deacetylase Sirtuin-2 NAD-dependent deacetylase sirtuin 3 SIR2-like SIR2L SIR2_HUMAN Sirtuin 2 (SIRT2)
Type:
Hydrolase
Mol. Mass.:
43172.62
Organism:
Homo sapiens (Human)
Description:
Residue:
389
  
Inhibitor
Name:
BDBM50350511
Synonyms:
CHEMBL1814816
Type:
Small organic molecule
Emp. Form.:
C26H47N7O7
Mol. Mass.:
569.6941
SMILES:
CC(=O)NCCCC[C@H](NC(=O)[C@H](CCCCCC(N)=O)NC(=O)[C@H](CCCCNC(C)=O)NC(C)=O)C(N)=O
: