Target
NAD-dependent protein deacetylase sirtuin-3, mitochondrial
Ligand
BDBM50350511
Substrate
Meas. Tech.
ChEMBL_762657 (CHEMBL1817381)
IC50
213500±n/a nM
Citation
 Hirsch, BMHao, YLi, XWesdemiotis, CWang, ZZheng, W A mechanism-based potent sirtuin inhibitor containing Ne-thiocarbamoyl-lysine (TuAcK). Bioorg Med Chem Lett 21:4753-7 (2011)  
Target
Name:
NAD-dependent protein deacetylase sirtuin-3, mitochondrial
Synonyms:
NAD-dependent deacetylase sirtuin 3 SIR2L3 SIRT3
Type:
Protein
Mol. Mass.:
43582.69
Organism:
Homo sapiens (Human)
Description:
Q9NTG7
Residue:
399
  
Inhibitor
Name:
BDBM50350511
Synonyms:
CHEMBL1814816
Type:
Small organic molecule
Emp. Form.:
C26H47N7O7
Mol. Mass.:
569.6941
SMILES:
CC(=O)NCCCC[C@H](NC(=O)[C@H](CCCCCC(N)=O)NC(=O)[C@H](CCCCNC(C)=O)NC(C)=O)C(N)=O
: