Target
Carbonic anhydrase 2
Ligand
BDBM10861
Substrate
Meas. Tech.
ChEMBL_762737 (CHEMBL1815988)
pH
7.5±n/a
Ki
160±n/a nM
Comments
extracted
Citation
 Nishimori, IMinakuchi, TVullo, DScozzafava, ASupuran, CT Inhibition studies of theß-carbonic anhydrases from the bacterial pathogen Salmonella enterica serovar Typhimurium with sulfonamides and sulfamates. Bioorg Med Chem 19:5023-30 (2011)  
Target
Name:
Carbonic anhydrase 2
Synonyms:
CA-II CAC Carbonate dehydratase II Carbonic anhydrase 2 (CA-II) Carbonic anhydrase C Carbonic anhydrase II (CA-II) Carbonic anhydrase II (hCA II) | Carbonic anhydrase isoenzyme II (hCA II)
Type:
Enzyme
Mol. Mass.:
29250.71
Organism:
Homo sapiens (Human)
Description:
P00918
Residue:
260
  
Inhibitor
Name:
BDBM10861
Synonyms:
4-(2-aminoethyl)benzene-1-sulfonamide aromatic sulfonamide compound 7 | aromatic/heteroaromatic sulfonamide 6
Type:
Small organic molecule
Emp. Form.:
C8H12N2O2S
Mol. Mass.:
200.258
SMILES:
NCCc1ccc(cc1)S(N)(=O)=O
: