Target
72 kDa type IV collagenase
Ligand
BDBM50351038
Substrate
Meas. Tech.
ChEMBL_763989 (CHEMBL1820072)
IC50
111300±n/a nM
Citation
 Jia, MYang, KFang, HXu, YSun, SSu, LXu, W Novel aminopeptidase N (APN/CD13) inhibitors derived from chloramphenicol amine. Bioorg Med Chem 19:5190-8 (2011)  
Target
Name:
72 kDa type IV collagenase
Synonyms:
72 kDa gelatinase CLG4A Gelatinase A (MMP-2) MMP2_HUMAN Matrix metalloproteinase-2 (MMP 2) Matrix metalloproteinases 2 (MMP-2) | TBE-1
Type:
Enzyme
Mol. Mass.:
73870.36
Organism:
Homo sapiens (Human)
Description:
P08253
Residue:
660
  
Inhibitor
Name:
BDBM50351038
Synonyms:
CHEMBL1819442
Type:
Small organic molecule
Emp. Form.:
C18H24N4O3
Mol. Mass.:
344.4082
SMILES:
N[C@@H](CNC(=O)[C@@H](N)Cc1ccc(O)cc1)[C@@H](O)c1ccc(N)cc1
: