Target
Kinesin-like protein KIF11
Ligand
BDBM50351256
Substrate
Meas. Tech.
ChEMBL_764354 (CHEMBL1820906)
EC50
294±n/a nM
Citation
 Rodriguez, DRamesh, CHenson, LHWilmeth, LBryant, BKKadavakollu, SHirsch, RMontoya, JHowell, PRGeorge, JMAlexander, DJohnson, DLArterburn, JBShuster, CB Synthesis and characterization of tritylthioethanamine derivatives with potent KSP inhibitory activity. Bioorg Med Chem 19:5446-53 (2011)  
Target
Name:
Kinesin-like protein KIF11
Synonyms:
EG5 KIF11_HUMAN Kinesin Spindle Protein Eg5 TRIP5 | kinesin spindle protein
Type:
PROTEIN
Mol. Mass.:
119138.97
Organism:
Homo sapiens (Human)
Description:
ChEMBL_1457426
Residue:
1056
  
Inhibitor
Name:
BDBM50351256
Synonyms:
CHEMBL1818526
Type:
Small organic molecule
Emp. Form.:
C22H23NOS
Mol. Mass.:
349.489
SMILES:
N[C@H](CO)CSC(c1ccccc1)(c1ccccc1)c1ccccc1
: