Target
Sodium/glucose cotransporter 2
Ligand
BDBM50351410
Substrate
Meas. Tech.
ChEMBL_764539 (CHEMBL1821091)
IC50
1.38±n/a nM
Citation
 Kim, MJLee, SHPark, SOKang, HLee, JSLee, KNJung, MEKim, JLee, J Novel macrocyclic C-aryl glucoside SGLT2 inhibitors as potential antidiabetic agents. Bioorg Med Chem 19:5468-79 (2011)  
Target
Name:
Sodium/glucose cotransporter 2
Synonyms:
Na(+)/glucose cotransporter 2 SGLT2 Sodium-Dependent Glucose Cotransporter 2 (SGLT2) Solute carrier family 5 member 2
Type:
Protein
Mol. Mass.:
72902.00
Organism:
Homo sapiens (Human)
Description:
P31639
Residue:
672
  
Inhibitor
Name:
BDBM50351410
Synonyms:
CHEMBL1819201
Type:
Small organic molecule
Emp. Form.:
C26H31ClO8
Mol. Mass.:
506.973
SMILES:
O[C@H]1[C@H](O)[C@H]2COCCCCCOc3cc(Cl)c(Cc4ccc5OCCOc5c4)cc3[C@H](O2)[C@@H]1O
: