Target
Sodium/glucose cotransporter 2
Ligand
BDBM50351413
Substrate
Meas. Tech.
ChEMBL_764539 (CHEMBL1821091)
IC50
0.974±n/a nM
Citation
 Kim, MJLee, SHPark, SOKang, HLee, JSLee, KNJung, MEKim, JLee, J Novel macrocyclic C-aryl glucoside SGLT2 inhibitors as potential antidiabetic agents. Bioorg Med Chem 19:5468-79 (2011)  
Target
Name:
Sodium/glucose cotransporter 2
Synonyms:
Na(+)/glucose cotransporter 2 SGLT2 Sodium-Dependent Glucose Cotransporter 2 (SGLT2) Solute carrier family 5 member 2
Type:
Protein
Mol. Mass.:
72902.00
Organism:
Homo sapiens (Human)
Description:
P31639
Residue:
672
  
Inhibitor
Name:
BDBM50351413
Synonyms:
CHEMBL1819095
Type:
Small organic molecule
Emp. Form.:
C25H29ClO7
Mol. Mass.:
476.947
SMILES:
CCOc1ccc(Cc2cc3[C@@H]4O[C@H](COC\C=C/COc3cc2Cl)[C@@H](O)[C@H](O)[C@H]4O)cc1
: