Target
Sterol regulatory element-binding protein 2
Ligand
BDBM78179
Substrate
Meas. Tech.
ChEMBL_765688 (CHEMBL1827133)
IC50
5600±n/a nM
Citation
 Kamisuki, SShirakawa, TKugimiya, AAbu-Elheiga, LChoo, HYYamada, KShimogawa, HWakil, SJUesugi, M Synthesis and evaluation of diarylthiazole derivatives that inhibit activation of sterol regulatory element-binding proteins. J Med Chem 54:4923-7 (2011)  
Target
Name:
Sterol regulatory element-binding protein 2
Synonyms:
BHLHD2 SREBF2 | SREBP2
Type:
PROTEIN
Mol. Mass.:
123713.87
Organism:
Homo sapiens (Human)
Description:
ChEMBL_765690
Residue:
1141
  
Inhibitor
Name:
BDBM78179
Synonyms:
2-(2-propyl-4-pyridyl)-4-(p-tolyl)thiazole;hydrobromide 4-(4-methylphenyl)-2-(2-propyl-4-pyridinyl)thiazole;hydrobromide CHEMBL1621019 SMR000221636 | cid_2850562
Type:
Small organic molecule
Emp. Form.:
C18H18N2S
Mol. Mass.:
294.414
SMILES:
CCCc1cc(ccn1)-c1nc(cs1)-c1ccc(C)cc1
: