Target
Sterol regulatory element-binding protein 2
Ligand
BDBM50351522
Substrate
Meas. Tech.
ChEMBL_765688 (CHEMBL1827133)
IC50
>30000±n/a nM
Citation
 Kamisuki, SShirakawa, TKugimiya, AAbu-Elheiga, LChoo, HYYamada, KShimogawa, HWakil, SJUesugi, M Synthesis and evaluation of diarylthiazole derivatives that inhibit activation of sterol regulatory element-binding proteins. J Med Chem 54:4923-7 (2011)  
Target
Name:
Sterol regulatory element-binding protein 2
Synonyms:
BHLHD2 SREBF2 | SREBP2
Type:
PROTEIN
Mol. Mass.:
123713.87
Organism:
Homo sapiens (Human)
Description:
ChEMBL_765690
Residue:
1141
  
Inhibitor
Name:
BDBM50351522
Synonyms:
CHEMBL1300882 | cid_715106
Type:
Small organic molecule
Emp. Form.:
C15H12N2S
Mol. Mass.:
252.334
SMILES:
Cc1ccc(cc1)-c1csc(n1)-c1ccncc1
: