Target
Sterol regulatory element-binding protein 2
Ligand
BDBM50351533
Substrate
Meas. Tech.
ChEMBL_765688 (CHEMBL1827133)
IC50
8600±n/a nM
Citation
 Kamisuki, SShirakawa, TKugimiya, AAbu-Elheiga, LChoo, HYYamada, KShimogawa, HWakil, SJUesugi, M Synthesis and evaluation of diarylthiazole derivatives that inhibit activation of sterol regulatory element-binding proteins. J Med Chem 54:4923-7 (2011)  
Target
Name:
Sterol regulatory element-binding protein 2
Synonyms:
BHLHD2 SREBF2 | SREBP2
Type:
PROTEIN
Mol. Mass.:
123713.87
Organism:
Homo sapiens (Human)
Description:
ChEMBL_765690
Residue:
1141
  
Inhibitor
Name:
BDBM50351533
Synonyms:
CHEMBL1824668
Type:
Small organic molecule
Emp. Form.:
C17H17N3S
Mol. Mass.:
295.402
SMILES:
CCCc1cc(ccn1)-c1nc(cs1)-c1ccc(N)cc1
: