Target
Sterol regulatory element-binding protein 2
Ligand
BDBM50351538
Substrate
Meas. Tech.
ChEMBL_765690 (CHEMBL1827135)
IC50
1000±n/a nM
Citation
 Kamisuki, SShirakawa, TKugimiya, AAbu-Elheiga, LChoo, HYYamada, KShimogawa, HWakil, SJUesugi, M Synthesis and evaluation of diarylthiazole derivatives that inhibit activation of sterol regulatory element-binding proteins. J Med Chem 54:4923-7 (2011)  
Target
Name:
Sterol regulatory element-binding protein 2
Synonyms:
BHLHD2 SREBF2 | SREBP2
Type:
PROTEIN
Mol. Mass.:
123713.87
Organism:
Homo sapiens (Human)
Description:
ChEMBL_765690
Residue:
1141
  
Inhibitor
Name:
BDBM50351538
Synonyms:
CHEMBL1824673
Type:
Small organic molecule
Emp. Form.:
C18H19N3O2S2
Mol. Mass.:
373.492
SMILES:
CCCc1cc(ccn1)-c1nc(cs1)-c1ccc(NS(C)(=O)=O)cc1
: