Target
Beta-secretase 1
Ligand
BDBM50351934
Substrate
Meas. Tech.
ChEMBL_765828 (CHEMBL1827653)
IC50
10±n/a nM
Citation
 Cheng, YJudd, TCBartberger, MDBrown, JChen, KFremeau, RTHickman, DHitchcock, SAJordan, BLi, VLopez, PLouie, SWLuo, YMichelsen, KNixey, TPowers, TSRattan, CSickmier, EASt Jean, DJWahl, RCWen, PHWood, S From fragment screening to in vivo efficacy: optimization of a series of 2-aminoquinolines as potent inhibitors of beta-site amyloid precursor protein cleaving enzyme 1 (BACE1). J Med Chem 54:5836-57 (2011)  
Target
Name:
Beta-secretase 1
Synonyms:
ASP2 Aspartyl protease 2 BACE1 Beta-secretase (BACE) Beta-secretase 1 (BACE 1) Beta-secretase 1 (BACE1) Beta-site amyloid precursor protein cleaving enzyme 1 Memapsin-2 beta-Secretase (BACE-1) | beta-Secretase (BACE1)
Type:
Protein
Mol. Mass.:
55755.10
Organism:
Homo sapiens (Human)
Description:
P56817
Residue:
501
  
Inhibitor
Name:
BDBM50351934
Synonyms:
CHEMBL1821825
Type:
Small organic molecule
Emp. Form.:
C26H31N3O2
Mol. Mass.:
417.5432
SMILES:
C[C@H](Cc1cc2cc(ccc2nc1N)-c1ccccc1C)C(=O)NCC1CCOCC1
: