Target
Beta-secretase 1
Ligand
BDBM50351940
Substrate
Meas. Tech.
ChEMBL_765829 (CHEMBL1827654)
IC50
110±n/a nM
Citation
 Cheng, YJudd, TCBartberger, MDBrown, JChen, KFremeau, RTHickman, DHitchcock, SAJordan, BLi, VLopez, PLouie, SWLuo, YMichelsen, KNixey, TPowers, TSRattan, CSickmier, EASt Jean, DJWahl, RCWen, PHWood, S From fragment screening to in vivo efficacy: optimization of a series of 2-aminoquinolines as potent inhibitors of beta-site amyloid precursor protein cleaving enzyme 1 (BACE1). J Med Chem 54:5836-57 (2011)  
Target
Name:
Beta-secretase 1
Synonyms:
ASP2 Aspartyl protease 2 BACE1 Beta-secretase (BACE) Beta-secretase 1 (BACE 1) Beta-secretase 1 (BACE1) Beta-site amyloid precursor protein cleaving enzyme 1 Memapsin-2 beta-Secretase (BACE-1) | beta-Secretase (BACE1)
Type:
Protein
Mol. Mass.:
55755.10
Organism:
Homo sapiens (Human)
Description:
P56817
Residue:
501
  
Inhibitor
Name:
BDBM50351940
Synonyms:
CHEMBL1821830
Type:
Small organic molecule
Emp. Form.:
C27H33N3O2
Mol. Mass.:
431.5698
SMILES:
CC(Cc1cc2cc(ccc2nc1N)-c1ccccc1C(C)=O)C(=O)NCCC(C)(C)C
: