Target
Melatonin receptor type 1A
Ligand
BDBM50352003
Substrate
Meas. Tech.
ChEMBL_766803 (CHEMBL1827743)
Ki
0.04±n/a nM
Citation
 El Kazzouli, SGriffon du Bellay, ABerteina-Raboin, SDelagrange, PCaignard, DHGuillaumet, G Design and synthesis of 2-phenylimidazo[1,2-a]pyridines as a novel class of melatonin receptor ligands. Eur J Med Chem 46:4252-7 (2011)  
Target
Name:
Melatonin receptor type 1A
Synonyms:
MTNR1A MTR1A_HUMAN Mel1a melatonin receptor Melatonin receptor Melatonin receptor type 1 (MT1) | Melatonin receptor type 1A
Type:
Enzyme
Mol. Mass.:
39392.94
Organism:
Homo sapiens (Human)
Description:
P48039
Residue:
350
  
Inhibitor
Name:
BDBM50352003
Synonyms:
CHEMBL1823015
Type:
Small organic molecule
Emp. Form.:
C18H19N3O2
Mol. Mass.:
309.3624
SMILES:
COc1ccc2[nH]c(c(CCNC(C)=O)c2n1)-c1ccccc1
: