Target
CDGSH iron-sulfur domain-containing protein 1
Ligand
BDBM50324736
Substrate
Meas. Tech.
ChEMBL_766432 (CHEMBL1826572)
IC50
82320±n/a nM
Citation
 Geldenhuys, WJFunk, MOAwale, PSLin, LCarroll, RT A novel binding assay identifies high affinity ligands to the rosiglitazone binding site of mitoNEET. Bioorg Med Chem Lett 21:5498-501 (2011)  
Target
Name:
CDGSH iron-sulfur domain-containing protein 1
Synonyms:
C10orf70 CISD1_HUMAN ZCD1
Type:
PROTEIN
Mol. Mass.:
12206.48
Organism:
Homo sapiens (Human)
Description:
ChEMBL_766432
Residue:
108
  
Inhibitor
Name:
BDBM50324736
Synonyms:
3-(2-aminoethyl)-5-(2-methoxybenzylidene)thiazolidine-2,4-dione L-136468
Type:
Small organic molecule
Emp. Form.:
C13H14N2O3S
Mol. Mass.:
278.327
SMILES:
COc1ccccc1\C=C1/SC(=O)N(CCN)C1=O
: