Target
CDGSH iron-sulfur domain-containing protein 1
Ligand
BDBM50350498
Substrate
Meas. Tech.
ChEMBL_766432 (CHEMBL1826572)
IC50
15120±n/a nM
Citation
 Geldenhuys, WJFunk, MOAwale, PSLin, LCarroll, RT A novel binding assay identifies high affinity ligands to the rosiglitazone binding site of mitoNEET. Bioorg Med Chem Lett 21:5498-501 (2011)  
Target
Name:
CDGSH iron-sulfur domain-containing protein 1
Synonyms:
C10orf70 CISD1_HUMAN ZCD1
Type:
PROTEIN
Mol. Mass.:
12206.48
Organism:
Homo sapiens (Human)
Description:
ChEMBL_766432
Residue:
108
  
Inhibitor
Name:
BDBM50350498
Synonyms:
CHEMBL1814650
Type:
Small organic molecule
Emp. Form.:
C11H9NOS2
Mol. Mass.:
235.325
SMILES:
CN1C(=S)S\C(=C\c2ccccc2)C1=O
: