Target
P2X purinoceptor 7
Ligand
BDBM50352059
Substrate
Meas. Tech.
ChEMBL_766436 (CHEMBL1826576)
IC50
0.500000±n/a nM
Citation
 Subramanyam, CDuplantier, AJDombroski, MAChang, SPGabel, CAWhitney-Pickett, CPerregaux, DGLabasi, JMYoon, KShepard, RMFisher, M Discovery, synthesis and SAR of azinyl- and azolylbenzamides antagonists of the P2X7 receptor. Bioorg Med Chem Lett 21:5475-9 (2011)  
Target
Name:
P2X purinoceptor 7
Synonyms:
ATP receptor P2RX7_HUMAN P2X purinoceptor 7 (P2X7) P2Z receptor | Purinergic receptor
Type:
Protein
Mol. Mass.:
68602.85
Organism:
Homo sapiens (Human)
Description:
Q99572
Residue:
595
  
Inhibitor
Name:
BDBM50352059
Synonyms:
CHEMBL1824026
Type:
Small organic molecule
Emp. Form.:
C22H31ClN4O3
Mol. Mass.:
434.96
SMILES:
Cc1cc(nn1C[C@@H](O)CN)-c1ccc(Cl)c(c1)C(=O)NCC1(O)CCCCCC1
: