Target
P2X purinoceptor 7
Ligand
BDBM50352058
Substrate
Meas. Tech.
ChEMBL_766434 (CHEMBL1826574)
IC50
7±n/a nM
Citation
 Subramanyam, CDuplantier, AJDombroski, MAChang, SPGabel, CAWhitney-Pickett, CPerregaux, DGLabasi, JMYoon, KShepard, RMFisher, M Discovery, synthesis and SAR of azinyl- and azolylbenzamides antagonists of the P2X7 receptor. Bioorg Med Chem Lett 21:5475-9 (2011)  
Target
Name:
P2X purinoceptor 7
Synonyms:
ATP receptor P2RX7_HUMAN P2X purinoceptor 7 (P2X7) P2Z receptor | Purinergic receptor
Type:
Protein
Mol. Mass.:
68602.85
Organism:
Homo sapiens (Human)
Description:
Q99572
Residue:
595
  
Inhibitor
Name:
BDBM50352058
Synonyms:
CHEMBL560241
Type:
Small organic molecule
Emp. Form.:
C19H24ClN3O2
Mol. Mass.:
361.866
SMILES:
Cc1cc(n[nH]1)-c1ccc(Cl)c(c1)C(=O)NCC1(O)CCCCCC1
: