Target
Histamine H3 receptor
Ligand
BDBM50319511
Substrate
Meas. Tech.
ChEMBL_766669 (CHEMBL1827363)
Ki
0.25±n/a nM
Citation
 Levoin, NLabeeuw, OCalmels, TPoupardin-Olivier, OBerrebi-Bertrand, ILecomte, JMSchwartz, JCCapet, M Novel and highly potent histamine H3 receptor ligands. Part 1: withdrawing of hERG activity. Bioorg Med Chem Lett 21:5378-83 (2011)  
Target
Name:
Histamine H3 receptor
Synonyms:
G-protein coupled receptor 97 HH3R HRH3 Histamine H3 receptor (H3) Histamine receptor (H3 and H4)
Type:
G Protein-Coupled Receptor (GPCR)
Mol. Mass.:
48691.47
Organism:
Homo sapiens (Human)
Description:
Binding assays were using CHO cells stably expressing hH3R receptors.
Residue:
445
  
Inhibitor
Name:
BDBM50319511
Synonyms:
(R)-2-(6-chloropyridin-3-yl)-6-(2-(2-methylpyrrolidin-1-yl)ethyl)quinoline | CHEMBL1083407
Type:
Small organic molecule
Emp. Form.:
C21H22ClN3
Mol. Mass.:
351.872
SMILES:
C[C@@H]1CCCN1CCc1ccc2nc(ccc2c1)-c1ccc(Cl)nc1
: