Target
Hepatocyte growth factor receptor
Ligand
BDBM50352537
Substrate
Meas. Tech.
ChEMBL_767236 (CHEMBL1826482)
IC50
>10000±n/a nM
Citation
 Cui, JJTran-Dubé, MShen, HNambu, MKung, PPPairish, MJia, LMeng, JFunk, LBotrous, IMcTigue, MGrodsky, NRyan, KPadrique, EAlton, GTimofeevski, SYamazaki, SLi, QZou, HChristensen, JMroczkowski, BBender, SKania, RSEdwards, MP Structure based drug design of crizotinib (PF-02341066), a potent and selective dual inhibitor of mesenchymal-epithelial transition factor (c-MET) kinase and anaplastic lymphoma kinase (ALK). J Med Chem 54:6342-63 (2011)  
Target
Name:
Hepatocyte growth factor receptor
Synonyms:
Hepatocyte growth factor receptor Hepatocyte growth factor receptor (c-MET) MET Met proto-oncogene (hepatocyte growth factor receptor) Tyrosine-protein kinase Met (c-Met) c-Met kinase
Type:
Protein
Mol. Mass.:
155559.73
Organism:
Homo sapiens (Human)
Description:
P08581
Residue:
1390
  
Inhibitor
Name:
BDBM50352537
Synonyms:
CHEMBL1824881
Type:
Small organic molecule
Emp. Form.:
C14H10Cl2FN3O
Mol. Mass.:
326.153
SMILES:
CC(Oc1cc(cnc1N)C#N)c1c(Cl)ccc(F)c1Cl
: