Target
Mitogen-activated protein kinase 8
Ligand
BDBM50352627
Substrate
Meas. Tech.
ChEMBL_767486 (CHEMBL1825598)
IC50
7±n/a nM
Citation
 Bowers, STruong, APJeffrey Neitz, RHom, RKSealy, JMProbst, GDQuincy, DPeterson, BChan, WGalemmo, RAKonradi, AWSham, HLTóth, GPan, HLin, MYao, NArtis, DRZhang, HChen, LDryer, MSamant, BZmolek, WWong, KLorentzen, CGoldbach, ETonn, GQuinn, KPSauer, JMWright, SPowell, KRuslim, LRen, ZBard, FYednock, TAGriswold-Prenner, I Design and synthesis of brain penetrant selective JNK inhibitors with improved pharmacokinetic properties for the prevention of neurodegeneration. Bioorg Med Chem Lett 21:5521-7 (2011)  
Target
Name:
Mitogen-activated protein kinase 8
Synonyms:
JNK-46 JNK1-alpha-1 MK08_HUMAN PRKM8 SAPK1C c-Jun N-terminal kinase 1 c-Jun N-terminal kinase 1(JNK1) | c-Jun N-terminal kinase 2 (JNK2)
Type:
Enzyme
Mol. Mass.:
48297.57
Organism:
Homo sapiens (Human)
Description:
JNK-1 was purchased from Upstate Cell Signaling Solutions (formerly Upstate Biotechnology).
Residue:
427
  
Inhibitor
Name:
BDBM50352627
Synonyms:
CHEMBL1822308 | US9796706, Compound 134
Type:
Small organic molecule
Emp. Form.:
C20H11F3N4O2S2
Mol. Mass.:
460.452
SMILES:
FC(F)(F)c1ccc2n(CC(=O)Nc3scc(C#N)c3-c3nccs3)c(=O)ccc2c1
: