Target
Beta-secretase 2
Ligand
BDBM50352872
Substrate
Meas. Tech.
ChEMBL_767494 (CHEMBL1825606)
IC50
18±n/a nM
Citation
 Malamas, MSErdei, JGunawan, IBarnes, KHui, YJohnson, MRobichaud, AZhou, PYan, YSolvibile, WTurner, JFan, KYChopra, RBard, JPangalos, MN New pyrazolyl and thienyl aminohydantoins as potent BACE1 inhibitors: exploring the S2' region. Bioorg Med Chem Lett 21:5164-70 (2011)  
Target
Name:
Beta-secretase 2
Synonyms:
AEPLC ASP1 Asp 1 Aspartyl protease 1 BACE2_HUMAN Beta-secretase (BACE) Beta-secretase 2 (BACE-2) Beta-site APP-cleaving enzyme 2 Memapsin-1 beta-Secretase (BACE-2)
Type:
Protein
Mol. Mass.:
56171.20
Organism:
Homo sapiens (Human)
Description:
Q9Y5Z0
Residue:
518
  
Inhibitor
Name:
BDBM50352872
Synonyms:
CHEMBL1824341
Type:
Small organic molecule
Emp. Form.:
C23H25FN6O
Mol. Mass.:
420.4826
SMILES:
CC(C)CCn1cc(cn1)C1(N=C(N)N(C)C1=O)c1cccc(c1)-c1cccnc1F
: