Target
Cathepsin D
Ligand
BDBM50352872
Substrate
Meas. Tech.
ChEMBL_767495 (CHEMBL1825607)
IC50
830±n/a nM
Citation
 Malamas, MSErdei, JGunawan, IBarnes, KHui, YJohnson, MRobichaud, AZhou, PYan, YSolvibile, WTurner, JFan, KYChopra, RBard, JPangalos, MN New pyrazolyl and thienyl aminohydantoins as potent BACE1 inhibitors: exploring the S2' region. Bioorg Med Chem Lett 21:5164-70 (2011)  
Target
Name:
Cathepsin D
Synonyms:
CATD_HUMAN CTSD Cathepsin D heavy chain Cathepsin D precursor
Type:
Enzyme
Mol. Mass.:
44551.72
Organism:
Homo sapiens (Human)
Description:
Human proCathepsin D (SwissProt accession number P07339) was expressed in Sf9 cells, purified, and autoactivated.
Residue:
412
  
Inhibitor
Name:
BDBM50352872
Synonyms:
CHEMBL1824341
Type:
Small organic molecule
Emp. Form.:
C23H25FN6O
Mol. Mass.:
420.4826
SMILES:
CC(C)CCn1cc(cn1)C1(N=C(N)N(C)C1=O)c1cccc(c1)-c1cccnc1F
: