Target
Aminopeptidase N
Ligand
BDBM50353020
Substrate
Meas. Tech.
ChEMBL_766293 (CHEMBL1826225)
Ki
40±n/a nM
Citation
 Maiereanu, CSchmitt, CSchifano-Faux, NLe Nouën, DDefoin, ATarnus, C A novel amino-benzosuberone derivative is a picomolar inhibitor of mammalian aminopeptidase N/CD13. Bioorg Med Chem 19:5716-33 (2011)  
Target
Name:
Aminopeptidase N
Synonyms:
AMPN_PIG AP-M Alanyl aminopeptidase Aminopeptidase N (APN) Microsomal aminopeptidase pAPN
Type:
Protein
Mol. Mass.:
108810.25
Organism:
Sus scrofa (Pig)
Description:
P15145
Residue:
963
  
Inhibitor
Name:
BDBM50353020
Synonyms:
CHEMBL1821982
Type:
Small organic molecule
Emp. Form.:
C23H21NO
Mol. Mass.:
327.4189
SMILES:
NC1CCc2c(CC1=O)c(ccc2-c1ccccc1)-c1ccccc1
: