Target
Sodium/hydrogen exchanger 1
Ligand
BDBM50058759
Substrate
Meas. Tech.
ChEMBL_768436 (CHEMBL1832155)
IC50
30.7±n/a nM
Citation
 Jin, LJiang, XMDu, PXu, JGong, GQWang, QJXu, YG Synthesis and Na+/H+ exchanger inhibitory activity of benzoylguanidine derivatives. Eur J Med Chem 46:4107-16 (2011)  
Target
Name:
Sodium/hydrogen exchanger 1
Synonyms:
NHE-1 Nhe1 Slc9a1 | Solute carrier family 9 member 1
Type:
PROTEIN
Mol. Mass.:
91655.00
Organism:
Rattus norvegicus
Description:
ChEMBL_862370
Residue:
820
  
Inhibitor
Name:
BDBM50058759
Synonyms:
CHEMBL436559 Cariporide N-(4-Isopropyl-3-methanesulfonyl-benzoyl)-guanidine(Cariporide) N-(diaminomethylene)-4-isopropyl-3-(methylsulfonyl)benzamide
Type:
Small organic molecule
Emp. Form.:
C12H17N3O3S
Mol. Mass.:
283.347
SMILES:
CC(C)c1ccc(cc1S(C)(=O)=O)C(=O)NC(N)=N
: