Target
Metabotropic glutamate receptor 4
Ligand
BDBM50325108
Substrate
Meas. Tech.
ChEMBL_768726 (CHEMBL1831599)
EC50
20±n/a nM
Citation
 Hong, SPLiu, KGMa, GSabio, MUberti, MABacolod, MDPeterson, JZou, ZZRobichaud, AJDoller, D Tricyclic thiazolopyrazole derivatives as metabotropic glutamate receptor 4 positive allosteric modulators. J Med Chem 54:5070-81 (2011)  
Target
Name:
Metabotropic glutamate receptor 4
Synonyms:
GPRC1D GRM4_HUMAN MGLUR4 Metabotropic glutamate receptor 4 (mGlu4) metabotropic glutamate 4
Type:
Protein
Mol. Mass.:
101899.95
Organism:
Homo sapiens (Human)
Description:
Q14833
Residue:
912
  
Inhibitor
Name:
BDBM50325108
Synonyms:
CHEMBL1223381 | N-(3-chloro-4-(N-(2-chlorophenyl)sulfamoyl)phenyl)picolinamide
Type:
Small organic molecule
Emp. Form.:
C18H13Cl2N3O3S
Mol. Mass.:
422.285
SMILES:
Clc1ccccc1NS(=O)(=O)c1ccc(NC(=O)c2ccccn2)cc1Cl
: