Target
Proto-oncogene tyrosine-protein kinase Src
Ligand
BDBM50354476
Substrate
Meas. Tech.
ChEMBL_771562 (CHEMBL1837741)
Ki
90±n/a nM
Citation
 Radi, MBrullo, CCrespan, ETintori, CMusumeci, FBiava, MSchenone, SDreassi, EZamperini, CMaga, GPagano, DAngelucci, ABologna, MBotta, M Identification of potent c-Src inhibitors strongly affecting the proliferation of human neuroblastoma cells. Bioorg Med Chem Lett 21:5928-33 (2011)  
Target
Name:
Proto-oncogene tyrosine-protein kinase Src
Synonyms:
Calmodulin/Proto-oncogene tyrosine-protein kinase Src Proto-oncogene c-Src SRC SRC_HUMAN V-src sarcoma (Schmidt-Ruppin A-2) viral oncogene homolog (avian) p60-Src | pp60c-src
Type:
Protein
Mol. Mass.:
59838.60
Organism:
Homo sapiens (Human)
Description:
P12931
Residue:
536
  
Inhibitor
Name:
BDBM50354476
Synonyms:
CHEMBL1836673
Type:
Small organic molecule
Emp. Form.:
C20H18ClN5S
Mol. Mass.:
395.908
SMILES:
CSc1nc(Nc2cccc(Cl)c2)c2cnn(CCc3ccccc3)c2n1
: