Target
Corticotropin-releasing factor receptor 1
Ligand
BDBM50354983
Substrate
Meas. Tech.
ChEMBL_772056 (CHEMBL1837665)
Ki
0.291±n/a nM
Citation
 Miller, DCKlute, WBrown, AD Discovery of potent, metabolically stable purine CRF-1 antagonists with differentiated binding kinetic profiles. Bioorg Med Chem Lett 21:6108-11 (2011)  
Target
Name:
Corticotropin-releasing factor receptor 1
Synonyms:
CRF-R CRF1 CRFR1 CRH-R 1 CRHR1 Corticotropin-releasing factor receptor 1 (CRF-1) Corticotropin-releasing hormone receptor 1
Type:
Enzyme
Mol. Mass.:
50744.31
Organism:
Homo sapiens (Human)
Description:
P34998
Residue:
444
  
Inhibitor
Name:
BDBM50354983
Synonyms:
CHEMBL1836947
Type:
Small organic molecule
Emp. Form.:
C22H25F2N5O2
Mol. Mass.:
429.463
SMILES:
COc1cc(OC(F)F)ccc1-n1c(C)nc2c(NC(C3CC3)C3CC3)nc(C)nc12
: