Target
Amine oxidase [flavin-containing] B
Ligand
BDBM50355323
Substrate
Meas. Tech.
ChEMBL_772926 (CHEMBL1838814)
IC50
0.31±n/a nM
Citation
 Matos, MJTerán, CPérez-Castillo, YUriarte, ESantana, LViña, D Synthesis and study of a series of 3-arylcoumarins as potent and selective monoamine oxidase B inhibitors. J Med Chem 54:7127-37 (2011)  
Target
Name:
Amine oxidase [flavin-containing] B
Synonyms:
AOFB_HUMAN MAOB Monoamine oxidase type B (MAO B) Monoamine oxidase type B (MAOB)
Type:
Protein
Mol. Mass.:
58768.76
Organism:
Homo sapiens (Human)
Description:
P27338
Residue:
520
  
Inhibitor
Name:
BDBM50355323
Synonyms:
CHEMBL1835228
Type:
Small organic molecule
Emp. Form.:
C17H14O2
Mol. Mass.:
250.2919
SMILES:
Cc1ccc(cc1)-c1cc2cc(C)ccc2oc1=O
: