Target
Ribosomal protein S6 kinase alpha-4
Ligand
BDBM5655
Substrate
Meas. Tech.
ChEMBL_774286 (CHEMBL1908503)
Kd
1300±n/a nM
Citation
 Davis, MIHunt, JPHerrgard, SCiceri, PWodicka, LMPallares, GHocker, MTreiber, DKZarrinkar, PP Comprehensive analysis of kinase inhibitor selectivity. Nat Biotechnol 29:1046-51 (2011)  
Target
Name:
Ribosomal protein S6 kinase alpha-4
Synonyms:
90 kDa ribosomal protein S6 kinase 4 MSK2 Nuclear mitogen- and stress-activated protein kinase 2 RPS6KA4(Kin.Dom.1 - N-terminal) Ribosomal protein S6 kinase Ribosomal protein S6 kinase alpha-4 | Ribosomal protein kinase B
Type:
Serine/threonine-protein kinase
Mol. Mass.:
85620.38
Organism:
Homo sapiens (Human)
Description:
Recombinant MSK2 was phosphorylated by incubation with active p38alpha before assays.
Residue:
772
  
Inhibitor
Name:
BDBM5655
Synonyms:
2-(2-chlorophenyl)-5,7-dihydroxy-8-[(3S,4R)-3-hydroxy-1-methylpiperidin-4-yl]-4H-chromen-4-one Flavopiridol US9617225, Flavopiridol
Type:
Small organic molecule
Emp. Form.:
C21H20ClNO5
Mol. Mass.:
401.84
SMILES:
CN1CC[C@@H]([C@H](O)C1)c1c(O)cc(O)c2c1oc(cc2=O)-c1ccccc1Cl
: