Target
Cyclin-dependent kinase 16
Ligand
BDBM50026612
Substrate
Meas. Tech.
ChEMBL_774513 (CHEMBL1908730)
Kd
21±n/a nM
Citation
 Davis, MIHunt, JPHerrgard, SCiceri, PWodicka, LMPallares, GHocker, MTreiber, DKZarrinkar, PP Comprehensive analysis of kinase inhibitor selectivity. Nat Biotechnol 29:1046-51 (2011)  
Target
Name:
Cyclin-dependent kinase 16
Synonyms:
CDK16 PCTAIRE1 Serine/threonine-protein kinase PCTAIRE-1
Type:
Protein
Mol. Mass.:
55721.58
Organism:
Homo sapiens (Human)
Description:
Q00536
Residue:
496
  
Inhibitor
Name:
BDBM50026612
Synonyms:
BIBF-1120 US10981896, Compound Nintedanib US11208381, Nintedanib | Vargatef
Type:
Small organic molecule
Emp. Form.:
C31H33N5O4
Mol. Mass.:
539.6248
SMILES:
COC(=O)c1ccc2\C(=C(\Nc3ccc(cc3)N(C)C(=O)CN3CCN(C)CC3)c3ccccc3)C(=O)Nc2c1
: