Target
Cyclin-dependent kinase 16
Ligand
BDBM50355495
Substrate
Meas. Tech.
ChEMBL_774513 (CHEMBL1908730)
Kd
>10000±n/a nM
Citation
 Davis, MIHunt, JPHerrgard, SCiceri, PWodicka, LMPallares, GHocker, MTreiber, DKZarrinkar, PP Comprehensive analysis of kinase inhibitor selectivity. Nat Biotechnol 29:1046-51 (2011)  
Target
Name:
Cyclin-dependent kinase 16
Synonyms:
CDK16 PCTAIRE1 Serine/threonine-protein kinase PCTAIRE-1
Type:
Protein
Mol. Mass.:
55721.58
Organism:
Homo sapiens (Human)
Description:
Q00536
Residue:
496
  
Inhibitor
Name:
BDBM50355495
Synonyms:
CHEMBL1908391
Type:
Small organic molecule
Emp. Form.:
C28H30N6OS
Mol. Mass.:
498.642
SMILES:
CN1CCN(Cc2ccc(cc2)C(=O)Nc2ccc(C)c(Nc3nc(cs3)-c3cccnc3)c2)CC1
: