Target
Dual specificity mitogen-activated protein kinase kinase 4
Ligand
BDBM5446
Substrate
Meas. Tech.
ChEMBL_774382 (CHEMBL1908599)
Kd
>10000±n/a nM
Citation
 Davis, MIHunt, JPHerrgard, SCiceri, PWodicka, LMPallares, GHocker, MTreiber, DKZarrinkar, PP Comprehensive analysis of kinase inhibitor selectivity. Nat Biotechnol 29:1046-51 (2011)  
Target
Name:
Dual specificity mitogen-activated protein kinase kinase 4
Synonyms:
JNK-activating kinase 1 JNKK1 MAP2K4 MKK4 PRKMK4 SEK1 SKK1 | c-Jun N-terminal kinase kinase 1
Type:
PROTEIN
Mol. Mass.:
44294.29
Organism:
Homo sapiens (Human)
Description:
ChEMBL_1460558
Residue:
399
  
Inhibitor
Name:
BDBM5446
Synonyms:
CHEMBL553 Erlotinib N-(3-Ethynylphenyl)-6,7-bis(2-methoxyethoxy)-4-quinazolinamine Monohydrochloride OSI-774 US10189853, erlotinib US11524945, Compound Erlotinib US9730934, Erlotinib cid_176870
Type:
Small organic molecule
Emp. Form.:
C22H23N3O4
Mol. Mass.:
393.4357
SMILES:
COCCOc1cc2ncnc(Nc3cccc(c3)C#C)c2cc1OCCOC
: