Target
Phosphorylase b kinase gamma catalytic chain, liver/testis isoform
Ligand
BDBM26474
Substrate
Meas. Tech.
ChEMBL_774277 (CHEMBL1908494)
Kd
>10000±n/a nM
Citation
 Davis, MIHunt, JPHerrgard, SCiceri, PWodicka, LMPallares, GHocker, MTreiber, DKZarrinkar, PP Comprehensive analysis of kinase inhibitor selectivity. Nat Biotechnol 29:1046-51 (2011)  
Target
Name:
Phosphorylase b kinase gamma catalytic chain, liver/testis isoform
Synonyms:
PHKG2 Phosphorylase kinase | Phosphorylase kinase gamma subunit 2
Type:
PROTEIN
Mol. Mass.:
46440.15
Organism:
Homo sapiens (Human)
Description:
ChEMBL_774277
Residue:
406
  
Inhibitor
Name:
BDBM26474
Synonyms:
5-({4-[(2,3-dimethyl-2H-indazol-6-yl)(methyl)amino]pyrimidin-2-yl}amino)-2-methylbenzene-1-sulfonamide JMC514632 Compound 13 cid_10113978
Type:
Small organic molecule
Emp. Form.:
C21H23N7O2S
Mol. Mass.:
437.518
SMILES:
CN(c1ccc2c(C)n(C)nc2c1)c1ccnc(Nc2ccc(C)c(c2)S(N)(=O)=O)n1
: