Target
Mitogen-activated protein kinase kinase kinase 11
Ligand
BDBM13216
Substrate
Meas. Tech.
ChEMBL_774346 (CHEMBL1908563)
Kd
>10000±n/a nM
Citation
 Davis, MIHunt, JPHerrgard, SCiceri, PWodicka, LMPallares, GHocker, MTreiber, DKZarrinkar, PP Comprehensive analysis of kinase inhibitor selectivity. Nat Biotechnol 29:1046-51 (2011)  
Target
Name:
Mitogen-activated protein kinase kinase kinase 11
Synonyms:
M3K11_HUMAN MLK3 Mixed Lineage Kinase 3 (MLK3) SPRK
Type:
PROTEIN
Mol. Mass.:
92696.93
Organism:
Homo sapiens (Human)
Description:
ChEMBL_1460565
Residue:
847
  
Inhibitor
Name:
BDBM13216
Synonyms:
BMS-354825 DASATINIB N-(2-chloro-6-methylphenyl)-2-({6-[4-(2-hydroxyethyl)piperazin-1-yl]-2-methylpyrimidin-4-yl}amino)-1,3-thiazole-5-carboxamide US20230348453, Compound A8 med.21724, Compound Dasatinib
Type:
Small organic molecule
Emp. Form.:
C22H26ClN7O2S
Mol. Mass.:
488.006
SMILES:
Cc1nc(Nc2ncc(s2)C(=O)Nc2c(C)cccc2Cl)cc(n1)N1CCN(CCO)CC1
: