Target
Peripheral plasma membrane protein CASK
Ligand
BDBM50132260
Substrate
Meas. Tech.
ChEMBL_774229 (CHEMBL1908446)
Kd
>10000±n/a nM
Citation
 Davis, MIHunt, JPHerrgard, SCiceri, PWodicka, LMPallares, GHocker, MTreiber, DKZarrinkar, PP Comprehensive analysis of kinase inhibitor selectivity. Nat Biotechnol 29:1046-51 (2011)  
Target
Name:
Peripheral plasma membrane protein CASK
Synonyms:
CASK Calcium/calmodulin-dependent serine protein kinase Protein lin-2 homolog | hCASK
Type:
PROTEIN
Mol. Mass.:
105119.01
Organism:
Homo sapiens (Human)
Description:
ChEMBL_774229
Residue:
926
  
Inhibitor
Name:
BDBM50132260
Synonyms:
2-(2-Chloro-4-iodo-phenylamino)-N-cyclopropylmethoxy-3,4-difluoro-benzamide CHEMBL105442 PD-18435 US8575391, 341
Type:
Small organic molecule
Emp. Form.:
C17H14ClF2IN2O2
Mol. Mass.:
478.66
SMILES:
Fc1ccc(C(=O)NOCC2CC2)c(Nc2ccc(I)cc2Cl)c1F
: