Target
Activin receptor type-1
Ligand
BDBM50331096
Substrate
Meas. Tech.
ChEMBL_774299 (CHEMBL1908516)
Kd
3400±n/a nM
Citation
 Davis, MIHunt, JPHerrgard, SCiceri, PWodicka, LMPallares, GHocker, MTreiber, DKZarrinkar, PP Comprehensive analysis of kinase inhibitor selectivity. Nat Biotechnol 29:1046-51 (2011)  
Target
Name:
Activin receptor type-1
Synonyms:
2.7.11.30 ACVR1 ACVRLK2 ALK2/ACVR1 Activin receptor-like kinase 2 Activin receptor-like kinase 2 (ALK2/ACVR1) SKR1 TGF-B superfamily receptor type I | TSR-I
Type:
Mol. Mass.:
57158.32
Organism:
Homo sapiens (Human)
Description:
Residue:
509
  
Inhibitor
Name:
BDBM50331096
Synonyms:
4-(4-fluoro-2-methyl-1H-indol-5-yloxy)-6-methoxy-7-(3-(pyrrolidin-1-yl)propoxy)quinazoline Cediranib ZD-2171
Type:
Small organic molecule
Emp. Form.:
C25H27FN4O3
Mol. Mass.:
450.5053
SMILES:
COc1cc2c(Oc3ccc4[nH]c(C)cc4c3F)ncnc2cc1OCCCN1CCCC1
: