Target
Dual specificity mitogen-activated protein kinase kinase 3
Ligand
BDBM60589
Substrate
Meas. Tech.
ChEMBL_774374 (CHEMBL1908591)
Kd
>10000±n/a nM
Citation
 Davis, MIHunt, JPHerrgard, SCiceri, PWodicka, LMPallares, GHocker, MTreiber, DKZarrinkar, PP Comprehensive analysis of kinase inhibitor selectivity. Nat Biotechnol 29:1046-51 (2011)  
Target
Name:
Dual specificity mitogen-activated protein kinase kinase 3
Synonyms:
Dual specificity mitogen-activated protein kinase kinase 3 MAP2K3 MAPK/ERK kinase 3 (MEK3) MEK3 MP2K3_HUMAN SKK2
Type:
Protein
Mol. Mass.:
39321.50
Organism:
Homo sapiens (Human)
Description:
Residue:
347
  
Inhibitor
Name:
BDBM60589
Synonyms:
6-{[6-(1-methyl-1H-pyrazol-4-yl)-[1,2,4]triazolo[4,3-b]pyridazin-3-yl]sulfanyl}quinoline (4) | BDBM50355498
Type:
Emp. Form.:
C18H13N7S
Mol. Mass.:
359.408
SMILES:
Cn1cc(cn1)-c1ccc2nnc(Sc3ccc4ncccc4c3)n2n1
: